BDBM350429 US10208066, Compound 48::US10611777, Compound 48
SMILES C[C@H](Nc1ncnc(N)c1C#N)c1cc2ncc(Cl)n2nc1-c1cccc(c1)C(F)(F)F
InChI Key InChIKey=STKVZOYTKWEULM-JTQLQIEISA-N
Data  6 IC50
  Tab Delimited (TSV)   2D SDfile   Computed 3D by Vconf -m prep SDfile
Find this compound or compounds like it in BindingDB:
Activity Spreadsheet -- Enzyme Inhibition Constant Data from BindingDB
Found 6 hits for monomerid = 350429
TargetPhosphatidylinositol 4,5-bisphosphate 3-kinase catalytic subunit delta isoform(Homo sapiens (Human))
Hutchison Medipharma
US Patent
LigandPNGBDBM350429(US10208066, Compound 48 | US10611777, Compound 48)
Affinity DataIC50:  9nM. Assay description: Briefly, the Transcreener KINASE Assay was designed as a simple two-part, endpoint assay as follows:1) Preparation of 25 uL kinase reaction: the 25 u...
Ligand InfoPC cidPC sid
In DepthDetails US Patent
TargetPhosphatidylinositol 4,5-bisphosphate 3-kinase catalytic subunit gamma isoform(Homo sapiens (Human))
Hutchison Medipharma
US Patent
LigandPNGBDBM350429(US10208066, Compound 48 | US10611777, Compound 48)
Affinity DataIC50:  1.33E+3nM. Assay description: Briefly, the Transcreener KINASE Assay was designed as a simple two-part, endpoint assay as follows:1) Preparation of 25 uL kinase reaction: the 25 u...
Ligand InfoPC cidPC sid
In DepthDetails US Patent
TargetPhosphatidylinositol 3-kinase regulatory subunit beta(Homo sapiens (Human))
Hutchison Medipharma
US Patent
LigandPNGBDBM350429(US10208066, Compound 48 | US10611777, Compound 48)
Affinity DataIC50:  4.08E+3nM. Assay description: PI3K kinases including p110α/p85α and p110γ were purchased from Invitrogen, p110δ/p85α and p110β/p85α were from Mi...
Ligand InfoPC cidPC sid
In DepthDetails US Patent
TargetPhosphatidylinositol 4,5-bisphosphate 3-kinase catalytic subunit delta isoform(Homo sapiens (Human))
Hutchison Medipharma
US Patent
LigandPNGBDBM350429(US10208066, Compound 48 | US10611777, Compound 48)
Affinity DataIC50:  9nM. Assay description: PI3K kinases including p110α/p85α and p110γ were purchased from Invitrogen, p110δ/p85α and p110β/p85α were from Mi...
Ligand InfoPC cidPC sid
In DepthDetails US Patent
TargetPhosphatidylinositol 4,5-bisphosphate 3-kinase catalytic subunit gamma isoform(Homo sapiens (Human))
Hutchison Medipharma
US Patent
LigandPNGBDBM350429(US10208066, Compound 48 | US10611777, Compound 48)
Affinity DataIC50:  1.33E+3nM. Assay description: PI3K kinases including p110α/p85α and p110γ were purchased from Invitrogen, p110δ/p85α and p110β/p85α were from Mi...
Ligand InfoPC cidPC sid
In DepthDetails US Patent
TargetPhosphatidylinositol 3-kinase regulatory subunit beta(Homo sapiens (Human))
Hutchison Medipharma
US Patent
LigandPNGBDBM350429(US10208066, Compound 48 | US10611777, Compound 48)
Affinity DataIC50:  4.08E+3nM. Assay description: Briefly, the Transcreener KINASE Assay was designed as a simple two-part, endpoint assay as follows:1) Preparation of 25 uL kinase reaction: the 25 u...
Ligand InfoPC cidPC sid
In DepthDetails US Patent