BDBM350463 US10208068, Example 18
SMILES COC(=O)Nc1ccc-2c(NC(=O)[C@H](C)CCC[C@H](NC(=O)c3ncn(c3Cl)-c3cccc(C)c3)c3cc-2ccn3)c1
InChI Key InChIKey=GVHVDMXRJODACT-DVECYGJZSA-N
Data  1 KI
  Tab Delimited (TSV)   2D SDfile   Computed 3D by Vconf -m prep SDfile
Find this compound or compounds like it in BindingDB:
Activity Spreadsheet -- Enzyme Inhibition Constant Data from BindingDB
Found 1 hit for monomerid = 350463
TargetCoagulation factor XI(Homo sapiens (Human))
Bristol-Myers Squibb
US Patent
LigandPNGBDBM350463(US10208068, Example 18)
Affinity DataKi:  98.7nM. Assay description: The effectiveness of compounds of the present invention as inhibitors of the coagulation Factors XIa, VIIa, IXa, Xa, XIIa, plasma kallikrein or throm...
Ligand InfoPC cidPC sid
In DepthDetails US Patent