BDBM350476 US10208068, Example 78
SMILES COC(=O)Nc1ccc-2c(NC(=O)[C@H](C)CCC[C@H](NC(=O)c3cnn(c3C)-c3cccc(Cl)c3F)c3cc-2ccn3)c1
InChI Key InChIKey=YVZSHLCZBRHGDU-OSPHWJPCSA-N
Data  2 KI
  Tab Delimited (TSV)   2D SDfile   Computed 3D by Vconf -m prep SDfile
Find this compound or compounds like it in BindingDB:
Activity Spreadsheet -- Enzyme Inhibition Constant Data from BindingDB
Found 2 hits for monomerid = 350476
TargetCoagulation factor XI(Homo sapiens (Human))
Bristol-Myers Squibb
Curated by ChEMBL
LigandPNGBDBM350476(US10208068, Example 78)
Affinity DataKi:  2.20nM. Assay description: Inhibition of human activated factor XI using pyro-Glu-Pro-Arg-pNA as substrate by spectrophotometry
Ligand InfoPC cidPC sid
In DepthDetails ArticlePubMed
TargetCoagulation factor XI(Homo sapiens (Human))
Bristol-Myers Squibb
Curated by ChEMBL
LigandPNGBDBM350476(US10208068, Example 78)
Affinity DataKi: <5nM. Assay description: The effectiveness of compounds of the present invention as inhibitors of the coagulation Factors XIa, VIIa, IXa, Xa, XIIa, plasma kallikrein or throm...
Ligand InfoPC cidPC sid
In DepthDetails US Patent