BDBM35048 benzothienopyrimidinone deriv., 20c
SMILES O[C@H]1CCN(Cc2nc3c4cc(ccc4sc3c(=O)[nH]2)-c2ccc(O)cc2)C1
InChI Key InChIKey=UPKYTOHUEMELIK-HNNXBMFYSA-N
Data  3 KI
  Tab Delimited (TSV)   2D SDfile   Computed 3D by Vconf -m prep SDfile
Find this compound or compounds like it in BindingDB:
Activity Spreadsheet -- Enzyme Inhibition Constant Data from BindingDB
Found 3 hits for monomerid = 35048
TargetSerine/threonine-protein kinase pim-3(Homo sapiens (Human))
Abbott Laboratories
LigandPNGBDBM35048(benzothienopyrimidinone deriv., 20c)
Affinity DataKi:  0.400nM ΔG°:  -12.8kcal/moleT: 2°C. Assay description: In 384-well v-bottom polypropylene plates, compound (2% DMSO) was mixed with Pim kinase and peptide substrate, followed by immediate initiation with ...
In DepthDetails ArticlePubMed
TargetSerine/threonine-protein kinase pim-1(Homo sapiens (Human))
Abbott Laboratories
LigandPNGBDBM35048(benzothienopyrimidinone deriv., 20c)
Affinity DataKi:  0.700nM ΔG°:  -12.5kcal/moleT: 2°C. Assay description: In 384-well v-bottom polypropylene plates, compound (2% DMSO) was mixed with Pim kinase and peptide substrate, followed by immediate initiation with ...
In DepthDetails ArticlePubMed
TargetSerine/threonine-protein kinase pim-2(Homo sapiens (Human))
Abbott Laboratories
LigandPNGBDBM35048(benzothienopyrimidinone deriv., 20c)
Affinity DataKi:  2nM ΔG°:  -11.9kcal/moleT: 2°C. Assay description: In 384-well v-bottom polypropylene plates, compound (2% DMSO) was mixed with Pim kinase and peptide substrate, followed by immediate initiation with ...
In DepthDetails ArticlePubMed