BDBM350559 3-[(4- bromophenyl)carbamoyl]-7,7- dimethylbicyclo[2.2.1]heptane- 2-carboxylic acid::US10208071, Compound 21::US10434112, Compound 21::US10799518, Compound 21
SMILES CC1(C)C2CCC1C(C2C(O)=O)C(=O)Nc1ccc(Br)cc1
InChI Key InChIKey=QDROLVBQDXNJDY-UHFFFAOYSA-N
Data  3 EC50
  Tab Delimited (TSV)   2D SDfile   Computed 3D by Vconf -m prep SDfile
Find this compound or compounds like it in BindingDB:
Activity Spreadsheet -- Enzyme Inhibition Constant Data from BindingDB
Found 3 hits for monomerid = 350559
TargetN-formyl peptide receptor 2(Homo sapiens (Human))
Allergan
US Patent
LigandPNGBDBM350559(3-[(4- bromophenyl)carbamoyl]-7,7- dimethylbicyclo...)
Affinity DataEC50:  1.00E+4nM. Assay description: HEK-Gα16 cells stably expressing the human FPR2 receptor was utilized. Cells were plated into 384-well poly-D-lysine coated plates at a density ...
Ligand InfoPC cidPC sid
In DepthDetails US Patent
TargetN-formyl peptide receptor 2(Homo sapiens (Human))
Allergan
US Patent
LigandPNGBDBM350559(3-[(4- bromophenyl)carbamoyl]-7,7- dimethylbicyclo...)
Affinity DataEC50:  10nM. Assay description: HEK-Gα16 cells stably expressing the human FPR2 receptor was utilized. Cells were plated into 384-well poly-D-lysine coated plates at a density ...
Ligand InfoPC cidPC sid
In DepthDetails US Patent
TargetN-formyl peptide receptor 2(Homo sapiens (Human))
Allergan
US Patent
LigandPNGBDBM350559(3-[(4- bromophenyl)carbamoyl]-7,7- dimethylbicyclo...)
Affinity DataEC50:  10nM. Assay description: HEK-Gα16 cells stably expressing the human FPR2 receptor was utilized. Cells were plated into 384-well poly-D-lysine coated plates at a density ...
Ligand InfoPC cidPC sid
In DepthDetails US Patent