BDBM350654 (2S)-2-{[(4- bromophenyl)carbamoyl]amino}- N-[(3-hydroxy-1,2-oxazol- 5-yl)methyl]-4- methylpentanamide::US10208071, Compound 116::US10434112, Compound 116::US10799518, Compound 116
SMILES CC(C)C[C@H](NC(=O)Nc1ccc(Br)cc1)C(=O)NCc1cc(O)no1
InChI Key InChIKey=WCGZSGWHOKVWEC-AWEZNQCLSA-N
Data  3 EC50
  Tab Delimited (TSV)   2D SDfile   Computed 3D by Vconf -m prep SDfile
Find this compound or compounds like it in BindingDB:
Activity Spreadsheet -- Enzyme Inhibition Constant Data from BindingDB
Found 3 hits for monomerid = 350654
TargetN-formyl peptide receptor 2(Homo sapiens (Human))
Allergan
US Patent
LigandPNGBDBM350654((2S)-2-{[(4- bromophenyl)carbamoyl]amino}- N-[(3-h...)
Affinity DataEC50:  1.20E+4nM. Assay description: HEK-Gα16 cells stably expressing the human FPR2 receptor was utilized. Cells were plated into 384-well poly-D-lysine coated plates at a density ...
Ligand InfoPC cidPC sid
In DepthDetails US Patent
TargetN-formyl peptide receptor 2(Homo sapiens (Human))
Allergan
US Patent
LigandPNGBDBM350654((2S)-2-{[(4- bromophenyl)carbamoyl]amino}- N-[(3-h...)
Affinity DataEC50:  12nM. Assay description: HEK-Gα16 cells stably expressing the human FPR2 receptor was utilized. Cells were plated into 384-well poly-D-lysine coated plates at a density ...
Ligand InfoPC cidPC sid
In DepthDetails US Patent
TargetN-formyl peptide receptor 2(Homo sapiens (Human))
Allergan
US Patent
LigandPNGBDBM350654((2S)-2-{[(4- bromophenyl)carbamoyl]amino}- N-[(3-h...)
Affinity DataEC50:  12nM. Assay description: HEK-Gα16 cells stably expressing the human FPR2 receptor was utilized. Cells were plated into 384-well poly-D-lysine coated plates at a density ...
Ligand InfoPC cidPC sid
In DepthDetails US Patent