BDBM350707 US10208081, Example 15
SMILES CC[C@H]1[C@@H](O)[C@H]2[C@@H]3CC[C@H]([C@H](C)CCNC(=O)NS(=O)(=O)c4ccc(OC)cc4)[C@@]3(C)CC[C@@H]2[C@@]2(C)CC[C@@H](O)C[C@@H]12
InChI Key InChIKey=JQAXPZFJTXMIAN-JIGGZYOVSA-N
Data  1 EC50
  Tab Delimited (TSV)   2D SDfile   Computed 3D by Vconf -m prep SDfile
Find this compound or compounds like it in BindingDB:
Activity Spreadsheet -- Enzyme Inhibition Constant Data from BindingDB
Found 1 hit for monomerid = 350707
TargetBile acid receptor(Homo sapiens (Human))
Enanta Pharmaceuticals
US Patent
LigandPNGBDBM350707(US10208081, Example 15)
Affinity DataEC50: <100nM. Assay description: The potency and efficacy of the compounds of the invention on TGR5 receptor was evaluated using in vitro assays which carried out using the express k...
Ligand InfoPC cidPC sid
In DepthDetails US Patent