BDBM350946 US9796700, Compound I-36
SMILES OCC(=O)N1CCC[C@@H](C1)Nc1ncc(c(N[C@@H]2CCCC[C@H]2NS(=O)(=O)C=C)n1)C(F)(F)F
InChI Key InChIKey=DROWNUHTTVLMGS-NUEKZKHPSA-N
Data  1 IC50
  Tab Delimited (TSV)   2D SDfile   Computed 3D by Vconf -m prep SDfile
Find this compound or compounds like it in BindingDB:
Activity Spreadsheet -- Enzyme Inhibition Constant Data from BindingDB
Found 1 hit for monomerid = 350946
TargetMitogen-activated protein kinase 3(Homo sapiens (Human))
Celgene Car
US Patent
LigandPNGBDBM350946(US9796700, Compound I-36)
Affinity DataIC50: <100nM. Assay description: The protocol below describes continuous-read kinase assays to measure potency of compounds against activated ERK1 enzyme. The mechanics of the assay ...
Ligand InfoPC cidPC sid
In DepthDetails US Patent