BDBM351002 US9796700, Compound I-92
SMILES COc1cc(Nc2ncc(c(Nc3ccccc3NC(=O)C=C)n2)C(F)(F)F)cc(n1)N1CCN(CC1)C(C)=O
InChI Key InChIKey=MTKIBPANKNCLBN-UHFFFAOYSA-N
Data  1 IC50
  Tab Delimited (TSV)   2D SDfile   Computed 3D by Vconf -m prep SDfile
Find this compound or compounds like it in BindingDB:
Activity Spreadsheet -- Enzyme Inhibition Constant Data from BindingDB
Found 1 hit for monomerid = 351002
TargetMitogen-activated protein kinase 3(Homo sapiens (Human))
Celgene Car
US Patent
LigandPNGBDBM351002(US9796700, Compound I-92)
Affinity DataIC50: <100nM. Assay description: The protocol below describes continuous-read kinase assays to measure potency of compounds against activated ERK1 enzyme. The mechanics of the assay ...
Ligand InfoPC cidPC sid
In DepthDetails US Patent