BDBM351201 1-Methyl-6-[4-[[1-(1-methylpyrazole-4-carbonyl)-4-piperidyl]methyl]-1H-pyrazol-3-yl]-3,4-dihydroquinolin-2-one::US9796702, 17
SMILES CN1C(=O)CCc2cc(ccc12)-c1n[nH]cc1CC1CCN(CC1)C(=O)c1cnn(C)c1
InChI Key InChIKey=KBEMHUWBBMUGIC-UHFFFAOYSA-N
Data  2 EC50
  Tab Delimited (TSV)   2D SDfile   Computed 3D by Vconf -m prep SDfile
Find this compound or compounds like it in BindingDB:
Activity Spreadsheet -- Enzyme Inhibition Constant Data from BindingDB
Found 2 hits for monomerid = 351201
TargetCytochrome P450 11B1, mitochondrial(Homo sapiens (Human))
Hoffmann-La Roche
US Patent
LigandPNGBDBM351201(1-Methyl-6-[4-[[1-(1-methylpyrazole-4-carbonyl)-4-...)
Affinity DataEC50:  1.20nM. Assay description: The expression plasmids contains the ORF for either human/cyno CYP11B1 or CYP11B2 under the control of a suitable promoter (CMV-promoter) and a suita...
Ligand InfoPC cidPC sid
In DepthDetails US Patent
TargetCytochrome P450 11B2, mitochondrial(Homo sapiens (Human))
Hoffmann-La Roche
US Patent
LigandPNGBDBM351201(1-Methyl-6-[4-[[1-(1-methylpyrazole-4-carbonyl)-4-...)
Affinity DataEC50:  0.00700nM. Assay description: The expression plasmids contains the ORF for either human/cyno CYP11B1 or CYP11B2 under the control of a suitable promoter (CMV-promoter) and a suita...
Ligand InfoPC cidPC sid
In DepthDetails US Patent