BDBM351386 1,4:3,6-dianhydro-2-deoxy-2-fluoro-5-O-{6- (methyloxy)-4-[(2,3,4- trichlorophenyl)amino]quinazolin-7-yl}-D-iditol::US9796704, Entry 106
SMILES COc1cc2c(Nc3ccc(Cl)c(Cl)c3Cl)ncnc2cc1O[C@@H]1CO[C@H]2[C@H](F)CO[C@@H]12
InChI Key InChIKey=PDTLXTDXRUZIGN-PDDAWLJDSA-N
Data  4 IC50
  Tab Delimited (TSV)   2D SDfile   Computed 3D by Vconf -m prep SDfile
Find this compound or compounds like it in BindingDB:
Activity Spreadsheet -- Enzyme Inhibition Constant Data from BindingDB
Found 4 hits for monomerid = 351386
TargetEphrin type-B receptor 4(Homo sapiens (Human))
Symphony Evolution
US Patent
LigandPNGBDBM351386(1,4:3,6-dianhydro-2-deoxy-2-fluoro-5-O-{6- (methyl...)
Affinity DataIC50: <50nM. Assay description: In AlphaScreen, when the donor and acceptor beads are close in proximity, a series of photochemical events will give rise to a fluorescent signal upo...
Ligand InfoPC cidPC sid
In DepthDetails US Patent
TargetEpidermal growth factor receptor(Homo sapiens (Human))
Symphony Evolution
US Patent
LigandPNGBDBM351386(1,4:3,6-dianhydro-2-deoxy-2-fluoro-5-O-{6- (methyl...)
Affinity DataIC50: <50nM. Assay description: In AlphaScreen, when the donor and acceptor beads are close in proximity, a series of photochemical events will give rise to a fluorescent signal upo...
Ligand InfoPC cidPC sid
In DepthDetails US Patent
TargetVascular endothelial growth factor receptor 2(Homo sapiens (Human))
Symphony Evolution
US Patent
LigandPNGBDBM351386(1,4:3,6-dianhydro-2-deoxy-2-fluoro-5-O-{6- (methyl...)
Affinity DataIC50: <50nM. Assay description: In AlphaScreen, when the donor and acceptor beads are close in proximity, a series of photochemical events will give rise to a fluorescent signal upo...
Ligand InfoPC cidPC sid
In DepthDetails US Patent
TargetEphrin type-A receptor 2(Homo sapiens (Human))
Symphony Evolution
US Patent
LigandPNGBDBM351386(1,4:3,6-dianhydro-2-deoxy-2-fluoro-5-O-{6- (methyl...)
Affinity DataIC50: <50nM. Assay description: In AlphaScreen, when the donor and acceptor beads are close in proximity, a series of photochemical events will give rise to a fluorescent signal upo...
Ligand InfoPC cidPC sid
In DepthDetails US Patent