BDBM3516 7-methoxy-N-phenylquinazolin-4-amine::CHEMBL92398::PD153035 Analog 15
SMILES COc1ccc2c(Nc3ccccc3)ncnc2c1
InChI Key InChIKey=LHBIFPBTEJYQLV-UHFFFAOYSA-N
Data  1 IC50
  Tab Delimited (TSV)   2D SDfile   Computed 3D by Vconf -m prep SDfile
Find this compound or compounds like it in BindingDB:
Activity Spreadsheet -- Enzyme Inhibition Constant Data from BindingDB
Found 1 hit for monomerid = 3516
TargetEpidermal growth factor receptor(Homo sapiens (Human))
Parke-Davis Pharmaceutical Research
LigandPNGBDBM3516(7-methoxy-N-phenylquinazolin-4-amine | CHEMBL92398...)
Affinity DataIC50:  120nMpH: 7.4 T: 2°C. Assay description: IC50 is the inhibitor concentration which inhibits 50% of kinase activity that catalyzes the transfer of the terminal phosphate from [gamma-32P] labe...
In DepthDetails ArticlePubMed