BDBM351690 US9796710, Compound 23
SMILES CCS(=O)(=O)c1ccc(cc1)[C@H](CO)NC(=O)c1cnc2C(N(C[C@H]3CC[C@@H](CC3)C(F)(F)F)Cc2c1)C(F)(F)F
InChI Key InChIKey=PAEYAORXIAXETF-UREAITJFSA-N
Data  1 KI
  Tab Delimited (TSV)   2D SDfile   Computed 3D by Vconf -m prep SDfile
Find this compound or compounds like it in BindingDB:
Activity Spreadsheet -- Enzyme Inhibition Constant Data from BindingDB
Found 1 hit for monomerid = 351690
TargetNuclear receptor ROR-gamma(Homo sapiens (Human))
Vitae Pharmaceuticals
US Patent
LigandPNGBDBM351690(US9796710, Compound 23)
Affinity DataKi: <100nM. Assay description: Compounds of the present invention were tested for ability to bind to ROR in a cell-free competition assay with commercially available radio-ligand (...
Ligand InfoPC cidPC sid
In DepthDetails US Patent