BDBM351710 N-(4-chloro-3-(1-(3-(dimethylamino)propyl)-1H-1,2,4-triazol-3-yl)thiophen-2-yl)-2-(2-oxo-6-(trifluoromethyl)quinolin-1(2H)-yl)acetamide::US9796706, Compound 154
SMILES CN(C)CCCn1cnc(n1)-c1c(Cl)csc1NC(=O)Cn1c2ccc(cc2ccc1=O)C(F)(F)F
InChI Key InChIKey=VVCXMAPEYLRREJ-UHFFFAOYSA-N
Data  3 IC50
  Tab Delimited (TSV)   2D SDfile   Computed 3D by Vconf -m prep SDfile
Find this compound or compounds like it in BindingDB:
Activity Spreadsheet -- Enzyme Inhibition Constant Data from BindingDB
Found 3 hits for monomerid = 351710
TargetMitogen-activated protein kinase 10(Homo sapiens (Human))
Imago Pharmaceuticals
US Patent
LigandPNGBDBM351710(N-(4-chloro-3-(1-(3-(dimethylamino)propyl)-1H-1,2,...)
Affinity DataIC50: <100nM. Assay description: (1) Assay buffer #1 with 0.0025% Tween and 1 mM DTT was prepared using JNK buffer stock solution.(2) Assay buffer #2 with 0.025% BSA was prepared usi...
Ligand InfoPC cidPC sid
In DepthDetails US Patent
TargetMitogen-activated protein kinase 9(Homo sapiens (Human))
Imago Pharmaceuticals
US Patent
LigandPNGBDBM351710(N-(4-chloro-3-(1-(3-(dimethylamino)propyl)-1H-1,2,...)
Affinity DataIC50: <100nM. Assay description: (1) Assay buffer #1 with 0.0025% Tween and 1 mM DTT was prepared using JNK buffer stock solution.(2) Assay buffer #2 with 0.025% BSA was prepared usi...
Ligand InfoPC cidPC sid
In DepthDetails US Patent
TargetMitogen-activated protein kinase 8(Homo sapiens (Human))
Imago Pharmaceuticals
US Patent
LigandPNGBDBM351710(N-(4-chloro-3-(1-(3-(dimethylamino)propyl)-1H-1,2,...)
Affinity DataIC50: <100nM. Assay description: (1) Assay buffer #1 with 0.0025% Tween and 1 mM DTT was prepared using JNK buffer stock solution.(2) Assay buffer #2 with 0.025% BSA was prepared usi...
Ligand InfoPC cidPC sid
In DepthDetails US Patent