BDBM351752 US9796710, Compound 45
SMILES CCS(=O)(=O)c1ccc(nc1)[C@H](CO)NC(=O)c1cnc2[C@H](C(C)C)N(C[C@H]3CC[C@@H](CC3)C(F)(F)F)Cc2c1
InChI Key InChIKey=GANNOLUMTRMNQH-KEBMUCTBSA-N
Data  1 KI
  Tab Delimited (TSV)   2D SDfile   Computed 3D by Vconf -m prep SDfile
Find this compound or compounds like it in BindingDB:
Activity Spreadsheet -- Enzyme Inhibition Constant Data from BindingDB
Found 1 hit for monomerid = 351752
TargetNuclear receptor ROR-gamma(Homo sapiens (Human))
Vitae Pharmaceuticals
US Patent
LigandPNGBDBM351752(US9796710, Compound 45)
Affinity DataKi: <100nM. Assay description: Compounds of the present invention were tested for ability to bind to ROR in a cell-free competition assay with commercially available radio-ligand (...
Ligand InfoPC cidPC sid
In DepthDetails US Patent