BDBM351784 US9796716, Compound 28
SMILES CC(=O)N1CCC[C@H](C1)n1nc(-c2ccc(Oc3cccc(OCc4ccccc4C#N)c3)cc2)c2c(N)ncnc12
InChI Key InChIKey=XRAVLTBOSAYOFX-RUZDIDTESA-N
Data  1 KI
  Tab Delimited (TSV)   2D SDfile   Computed 3D by Vconf -m prep SDfile
Find this compound or compounds like it in BindingDB:
Activity Spreadsheet -- Enzyme Inhibition Constant Data from BindingDB
Found 1 hit for monomerid = 351784
TargetTyrosine-protein kinase BTK(Homo sapiens (Human))
Pharmascience
US Patent
LigandPNGBDBM351784(US9796716, Compound 28)
Affinity DataKi: <100nM. Assay description: Fluorescence polarization-based kinase assays were performed in 384 well-plate format using histidine tagged recombinant human full-length Bruton Aga...
Ligand InfoPC cidPC sid
In DepthDetails US Patent