BDBM351788 US9796716, Compound 32
SMILES Nc1ncnc2n(nc(-c3ccc(Oc4cccc(COc5ccccc5C(F)(F)F)c4)cc3)c12)C1CCCC1
InChI Key InChIKey=OGAYHNSLJZXIKA-UHFFFAOYSA-N
Data  1 KI
  Tab Delimited (TSV)   2D SDfile   Computed 3D by Vconf -m prep SDfile
Find this compound or compounds like it in BindingDB:
Activity Spreadsheet -- Enzyme Inhibition Constant Data from BindingDB
Found 1 hit for monomerid = 351788
TargetTyrosine-protein kinase BTK(Homo sapiens (Human))
Pharmascience
US Patent
LigandPNGBDBM351788(US9796716, Compound 32)
Affinity DataKi: <100nM. Assay description: Fluorescence polarization-based kinase assays were performed in 384 well-plate format using histidine tagged recombinant human full-length Bruton Aga...
Ligand InfoPC cidPC sid
In DepthDetails US Patent