BDBM35180 indazole-benzimidazole, 16
SMILES CN(C)c1ccc(cc1)-c1ccc2c(n[nH]c2c1)-c1nc2c(cccc2[nH]1)N1CCN(C)CC1
InChI Key InChIKey=IHCHJFVOAVNRQY-UHFFFAOYSA-N
Data  1 IC50
  Tab Delimited (TSV)   2D SDfile   Computed 3D by Vconf -m prep SDfile
Find this compound or compounds like it in BindingDB:
Activity Spreadsheet -- Enzyme Inhibition Constant Data from BindingDB
Found 1 hit for monomerid = 35180
TargetProtein kinase C zeta type(Homo sapiens (Human))
Pfizer
LigandPNGBDBM35180(indazole-benzimidazole, 16)
Affinity DataIC50:  1.31E+3nMpH: 7.5 T: 2°C. Assay description: Protein kinase C (PKC), zeta activity was measured by following the phosphorylation of a biotinylated peptide substrate in the presence of ATP using ...
In DepthDetails ArticlePubMed