BDBM351814 US9796716, Compound 59
SMILES Cc1ncc(COc2cc(F)cc(Oc3ccc(cc3F)-c3nn(C4CCOCC4)c4ncnc(N)c34)c2)s1
InChI Key InChIKey=INGBCFIIDOFYOX-UHFFFAOYSA-N
Data  1 KI
  Tab Delimited (TSV)   2D SDfile   Computed 3D by Vconf -m prep SDfile
Find this compound or compounds like it in BindingDB:
Activity Spreadsheet -- Enzyme Inhibition Constant Data from BindingDB
Found 1 hit for monomerid = 351814
TargetTyrosine-protein kinase BTK(Homo sapiens (Human))
Pharmascience
US Patent
LigandPNGBDBM351814(US9796716, Compound 59)
Affinity DataKi: <100nM. Assay description: Fluorescence polarization-based kinase assays were performed in 384 well-plate format using histidine tagged recombinant human full-length Bruton Aga...
Ligand InfoPC cidPC sid
In DepthDetails US Patent