BDBM351835 US9796716, Compound 78
SMILES CC(C)n1nc(-c2ccc(Oc3cc(F)cc(OCc4cnc(C)s4)c3)cc2)c2c(N)ncnc12
InChI Key InChIKey=CIXFBKDZNZDQAF-UHFFFAOYSA-N
Data  1 KI
  Tab Delimited (TSV)   2D SDfile   Computed 3D by Vconf -m prep SDfile
Find this compound or compounds like it in BindingDB:
Activity Spreadsheet -- Enzyme Inhibition Constant Data from BindingDB
Found 1 hit for monomerid = 351835
TargetTyrosine-protein kinase BTK(Homo sapiens (Human))
Pharmascience
US Patent
LigandPNGBDBM351835(US9796716, Compound 78)
Affinity DataKi: <100nM. Assay description: Fluorescence polarization-based kinase assays were performed in 384 well-plate format using histidine tagged recombinant human full-length Bruton Aga...
Ligand InfoPC cidPC sid
In DepthDetails US Patent