BDBM351845 US9796716, Compound 88
SMILES Cc1ccc(COc2cc(F)cc(Oc3ccc(cc3)-c3nn(CCO)c4ncnc(N)c34)c2)cn1
InChI Key InChIKey=FEVGMISPGOZBKQ-UHFFFAOYSA-N
Data  1 KI
  Tab Delimited (TSV)   2D SDfile   Computed 3D by Vconf -m prep SDfile
Find this compound or compounds like it in BindingDB:
Activity Spreadsheet -- Enzyme Inhibition Constant Data from BindingDB
Found 1 hit for monomerid = 351845
TargetTyrosine-protein kinase BTK(Homo sapiens (Human))
Pharmascience
US Patent
LigandPNGBDBM351845(US9796716, Compound 88)
Affinity DataKi: <100nM. Assay description: Fluorescence polarization-based kinase assays were performed in 384 well-plate format using histidine tagged recombinant human full-length Bruton Aga...
Ligand InfoPC cidPC sid
In DepthDetails US Patent