BDBM351911 (S)-Methyl 5-(5-(2-(1H-imidazo[4,5-b]pyrazin-2-yl)propan-2-yl)-9-fluoro-5H-chromeno[2,3-b]pyridin-2-yl)picolinate::US9796720, 26
SMILES COC(=O)c1ccc(cn1)-c1ccc2[C@H](c3cccc(F)c3Oc2n1)C(C)(C)c1nc2nccnc2[nH]1
InChI Key
Data  1 KI
  Tab Delimited (TSV)   2D SDfile   Computed 3D by Vconf -m prep SDfile
Find this compound or compounds like it in BindingDB:
Activity Spreadsheet -- Enzyme Inhibition Constant Data from BindingDB
Found 1 hit for monomerid = 351911
TargetGlucocorticoid receptor(Homo sapiens (Human))
Bristol-Myers Squibb
US Patent
LigandPNGBDBM351911((S)-Methyl 5-(5-(2-(1H-imidazo[4,5-b]pyrazin-2-yl)...)
Affinity DataKi:  144nM. Assay description: In order to measure the binding of compounds on the glucocorticoid receptor a commercially available kit was used (Glucocorticoid receptor competitor...
Ligand InfoPC cidPC sid
In DepthDetails US Patent