BDBM352036 US9802907, Compound 15
SMILES COc1ccc(cc1OC)-c1ccc(cc1C#N)-c1nc(C)c([se]1)C(O)=O
InChI Key InChIKey=ANPIKECPJBIJSM-UHFFFAOYSA-N
Data  1 IC50
  Tab Delimited (TSV)   2D SDfile   Computed 3D by Vconf -m prep SDfile
Find this compound or compounds like it in BindingDB:
Activity Spreadsheet -- Enzyme Inhibition Constant Data from BindingDB
Found 1 hit for monomerid = 352036
TargetXanthine dehydrogenase/oxidase(Homo sapiens (Human))
Jiangsu Atom Bioscience And Pharmaceutical
US Patent
LigandPNGBDBM352036(US9802907, Compound 15)
Affinity DataIC50:  3.25nM. Assay description: The inhibition of the activity of xanthine oxidase (XO) is tested through a coupled enzymatic reaction of xanthine oxidase, horseradish peroxidase (H...
Ligand InfoPC cidPC sid
In DepthDetails US Patent