BDBM352063 US9802907, Compound 51
SMILES CC(C)COc1ccc(cc1Cl)-c1nc(C)c([se]1)C(O)=O
InChI Key InChIKey=DMXWCSUBOUNUTQ-UHFFFAOYSA-N
Data  1 IC50
  Tab Delimited (TSV)   2D SDfile   Computed 3D by Vconf -m prep SDfile
Find this compound or compounds like it in BindingDB:
Activity Spreadsheet -- Enzyme Inhibition Constant Data from BindingDB
Found 1 hit for monomerid = 352063
TargetXanthine dehydrogenase/oxidase(Homo sapiens (Human))
Jiangsu Atom Bioscience And Pharmaceutical
US Patent
LigandPNGBDBM352063(US9802907, Compound 51)
Affinity DataIC50:  10.2nM. Assay description: The inhibition of the activity of xanthine oxidase (XO) is tested through a coupled enzymatic reaction of xanthine oxidase, horseradish peroxidase (H...
Ligand InfoPC cidPC sid
In DepthDetails US Patent