BDBM352111 (3R,4R,5S)-3-Amino-1-(3-(((6-(2,6-difluoro-4-((methylamino)methyl)phenyl)-5-fluoropyridin-2-yl)methyl)amino)pyridin-4-yl)-5-methylpiperidin-4-ol::US9802918, Example 40
SMILES CNCc1cc(F)c(c(F)c1)-c1nc(CNc2cnccc2N2C[C@H](C)[C@@H](O)[C@H](N)C2)ccc1F
InChI Key InChIKey=VXJSAFDDSRYGRN-ZTPWUFSZSA-N
Data  3 IC50
  Tab Delimited (TSV)   2D SDfile   Computed 3D by Vconf -m prep SDfile
Find this compound or compounds like it in BindingDB:
Activity Spreadsheet -- Enzyme Inhibition Constant Data from BindingDB
Found 3 hits for monomerid = 352111
TargetSerine/threonine-protein kinase pim-1(Homo sapiens (Human))
Incyte
US Patent
LigandPNGBDBM352111((3R,4R,5S)-3-Amino-1-(3-(((6-(2,6-difluoro-4-((met...)
Affinity DataIC50: <10nM. Assay description: Pim-1 and Pim-3 kinase assays-20 μL reactions were run in white 384 well polystyrene plates dotted with 0.8 μL compound/DMSO in the assay b...
Ligand InfoPC cidPC sid
In DepthDetails US Patent
TargetSerine/threonine-protein kinase pim-3(Homo sapiens (Human))
Incyte
US Patent
LigandPNGBDBM352111((3R,4R,5S)-3-Amino-1-(3-(((6-(2,6-difluoro-4-((met...)
Affinity DataIC50: <10nM. Assay description: Pim-1 and Pim-3 kinase assays-20 μL reactions were run in white 384 well polystyrene plates dotted with 0.8 μL compound/DMSO in the assay b...
Ligand InfoPC cidPC sid
In DepthDetails US Patent
TargetSerine/threonine-protein kinase pim-2(Homo sapiens (Human))
Incyte
US Patent
LigandPNGBDBM352111((3R,4R,5S)-3-Amino-1-(3-(((6-(2,6-difluoro-4-((met...)
Affinity DataIC50:  550nM. Assay description: Pim-1 and Pim-3 kinase assays-20 μL reactions were run in white 384 well polystyrene plates dotted with 0.8 μL compound/DMSO in the assay b...
Ligand InfoPC cidPC sid
In DepthDetails US Patent