BDBM352151 4-[(3S,5R)-3-Amino-5-methylpiperidin-1-yl]-N-{[6-(2,6-difluoro-4-methoxyphenyl)-5-fluoropyridin-2-yl]methyl}pyridin-3-amine::US9802918, Example 83
SMILES COc1cc(F)c(c(F)c1)-c1nc(CNc2cnccc2N2C[C@H](C)C[C@H](N)C2)ccc1F
InChI Key InChIKey=FALXLHKMUMCCRH-CABCVRRESA-N
Data  3 IC50
  Tab Delimited (TSV)   2D SDfile   Computed 3D by Vconf -m prep SDfile
Find this compound or compounds like it in BindingDB:
Activity Spreadsheet -- Enzyme Inhibition Constant Data from BindingDB
Found 3 hits for monomerid = 352151
TargetSerine/threonine-protein kinase pim-1(Homo sapiens (Human))
Incyte
US Patent
LigandPNGBDBM352151(4-[(3S,5R)-3-Amino-5-methylpiperidin-1-yl]-N-{[6-(...)
Affinity DataIC50: <10nM. Assay description: Pim-1 and Pim-3 kinase assays-20 μL reactions were run in white 384 well polystyrene plates dotted with 0.8 μL compound/DMSO in the assay b...
Ligand InfoPC cidPC sid
In DepthDetails US Patent
TargetSerine/threonine-protein kinase pim-3(Homo sapiens (Human))
Incyte
US Patent
LigandPNGBDBM352151(4-[(3S,5R)-3-Amino-5-methylpiperidin-1-yl]-N-{[6-(...)
Affinity DataIC50: <10nM. Assay description: Pim-1 and Pim-3 kinase assays-20 μL reactions were run in white 384 well polystyrene plates dotted with 0.8 μL compound/DMSO in the assay b...
Ligand InfoPC cidPC sid
In DepthDetails US Patent
TargetSerine/threonine-protein kinase pim-2(Homo sapiens (Human))
Incyte
US Patent
LigandPNGBDBM352151(4-[(3S,5R)-3-Amino-5-methylpiperidin-1-yl]-N-{[6-(...)
Affinity DataIC50: <100nM. Assay description: Pim-1 and Pim-3 kinase assays-20 μL reactions were run in white 384 well polystyrene plates dotted with 0.8 μL compound/DMSO in the assay b...
Ligand InfoPC cidPC sid
In DepthDetails US Patent