BDBM352174 2-[({4-[(3S,5R)-3-Amino-5-(trifluoromethyl)piperidin-1-yl]pyridin-3-yl}amino)methyl]-6-(2,6-difluorophenyl)-5-fluoropyridin-3-amine::US9802918, Example 109
SMILES N[C@H]1C[C@H](CN(C1)c1ccncc1NCc1nc(c(F)cc1N)-c1c(F)cccc1F)C(F)(F)F
InChI Key InChIKey=LQSTZXHYJIRCSG-OLZOCXBDSA-N
Data  3 IC50
  Tab Delimited (TSV)   2D SDfile   Computed 3D by Vconf -m prep SDfile
Find this compound or compounds like it in BindingDB:
Activity Spreadsheet -- Enzyme Inhibition Constant Data from BindingDB
Found 3 hits for monomerid = 352174
TargetSerine/threonine-protein kinase pim-1(Homo sapiens (Human))
Incyte
US Patent
LigandPNGBDBM352174(2-[({4-[(3S,5R)-3-Amino-5-(trifluoromethyl)piperid...)
Affinity DataIC50: <10nM. Assay description: Pim-1 and Pim-3 kinase assays-20 μL reactions were run in white 384 well polystyrene plates dotted with 0.8 μL compound/DMSO in the assay b...
Ligand InfoPC cidPC sid
In DepthDetails US Patent
TargetSerine/threonine-protein kinase pim-3(Homo sapiens (Human))
Incyte
US Patent
LigandPNGBDBM352174(2-[({4-[(3S,5R)-3-Amino-5-(trifluoromethyl)piperid...)
Affinity DataIC50: <10nM. Assay description: Pim-1 and Pim-3 kinase assays-20 μL reactions were run in white 384 well polystyrene plates dotted with 0.8 μL compound/DMSO in the assay b...
Ligand InfoPC cidPC sid
In DepthDetails US Patent
TargetSerine/threonine-protein kinase pim-2(Homo sapiens (Human))
Incyte
US Patent
LigandPNGBDBM352174(2-[({4-[(3S,5R)-3-Amino-5-(trifluoromethyl)piperid...)
Affinity DataIC50: <100nM. Assay description: Pim-1 and Pim-3 kinase assays-20 μL reactions were run in white 384 well polystyrene plates dotted with 0.8 μL compound/DMSO in the assay b...
Ligand InfoPC cidPC sid
In DepthDetails US Patent