BDBM35219 pyrimidoindolone, 22h
SMILES CC1(C)CN=C2N(C1)c1ccc(NS(=O)(=O)c3ccc(F)cc3)cc1C2=O
InChI Key InChIKey=ZTRWPSRAWREGQY-UHFFFAOYSA-N
Data  1 IC50
  Tab Delimited (TSV)   2D SDfile   Computed 3D by Vconf -m prep SDfile
Find this compound or compounds like it in BindingDB:
Activity Spreadsheet -- Enzyme Inhibition Constant Data from BindingDB
Found 1 hit for monomerid = 35219
TargetCaspase-3(Homo sapiens (Human))
Wyeth Research
LigandPNGBDBM35219(pyrimidoindolone, 22h)
Affinity DataIC50:  2.39E+3nMpH: 7.2 T: 2°C. Assay description: Caspase-3 was assayed at 23 deg C (room temp) in 96-well plates using the internally quenched tetrapeptide substrate. Enzymatic cleavage between the ...
In DepthDetails ArticlePubMed