BDBM352202 US10239868, Entry 6::US10287274, Entry 6::US10676464, Entry 6::US9802924, Entry 6
SMILES CCC1(CC)CC(CCN2CCN(CC2)c2ccccc2O)OC1=O
InChI Key InChIKey=DUUMJZVPXSFSAP-UHFFFAOYSA-N
Data  4 IC50
  Tab Delimited (TSV)   2D SDfile   Computed 3D by Vconf -m prep SDfile
Find this compound or compounds like it in BindingDB:
Activity Spreadsheet -- Enzyme Inhibition Constant Data from BindingDB
Found 4 hits for monomerid = 352202
Target5-hydroxytryptamine receptor 7(Homo sapiens (Human))
Temple University Of The Commonwealth System Of Higher Education
US Patent
LigandPNGBDBM352202(US10239868, Entry 6 | US10287274, Entry 6 | US1067...)
Affinity DataIC50:  156nM. Assay description: A solution of the compound of the disclosure to be tested is prepared as a 1-mg/ml stock in Assay Buffer or DMSO according to its solubility. A simil...
Ligand InfoPC cidPC sid
Target5-hydroxytryptamine receptor 2A(Homo sapiens (Human))
Temple University Of The Commonwealth System Of Higher Education
US Patent
LigandPNGBDBM352202(US10239868, Entry 6 | US10287274, Entry 6 | US1067...)
Affinity DataIC50:  156nM. Assay description: A solution of the compound of the disclosure to be tested is prepared as a 1-mg/ml stock in Assay Buffer or DMSO according to its solubility. A simil...
Ligand InfoPC cidPC sid
Target5-hydroxytryptamine receptor 7(Homo sapiens (Human))
Temple University Of The Commonwealth System Of Higher Education
US Patent
LigandPNGBDBM352202(US10239868, Entry 6 | US10287274, Entry 6 | US1067...)
Affinity DataIC50:  156nM. Assay description: A solution of the compound of the disclosure to be tested is prepared as a 1-mg/ml stock in Assay Buffer or DMSO according to its solubility. A simil...
Ligand InfoPC cidPC sid
Target5-hydroxytryptamine receptor 7(Homo sapiens (Human))
Temple University Of The Commonwealth System Of Higher Education
US Patent
LigandPNGBDBM352202(US10239868, Entry 6 | US10287274, Entry 6 | US1067...)
Affinity DataIC50:  156nM. Assay description: A stock concentration of 5 nM [3H]LSD (lysergic acid diethyl amide) is prepared in 50 mM Tris-HCl, 10 mM MgCl2, 1 mM EDTA, pH 7.4 (Assay Buffer). Ali...
Ligand InfoPC cidPC sid
In DepthDetails US Patent