BDBM352290 US9802939, I-9
SMILES COC(=O)Nc1ccc2-c3c[nH]c(n3)C(C\C=C\CC(=O)Nc2c1)NC(=O)c1cc(no1)-c1cccc(Cl)c1
InChI Key
Data  1 KI
  Tab Delimited (TSV)   2D SDfile   Computed 3D by Vconf -m prep SDfile
Find this compound or compounds like it in BindingDB:
Activity Spreadsheet -- Enzyme Inhibition Constant Data from BindingDB
Found 1 hit for monomerid = 352290
TargetCoagulation factor XI(Homo sapiens (Human))
Bristol-Myers Squibb
US Patent
LigandPNGBDBM352290(US9802939, I-9)
Affinity DataKi:  1.87E+3nM. Assay description: Factor XIa determinations were made in 50 mM HEPES buffer at pH 7.4 containing 145 mM NaCl, 5 mM KCl, and 0.1% PEG 8000 (polyethylene glycol; JT Bake...
Ligand InfoPC cidPC sid
In DepthDetails US Patent