BDBM352346 US11098048, Example 2.04::US9802944, Example 2.04
SMILES O=C(N1C[C@H]2CN(C[C@@H]2C1)C(=O)c1cnc(NC2CCOCC2)c(c1)C1CC1)c1ccc2[nH]nnc2c1
InChI Key
Data  2 IC50
  Tab Delimited (TSV)   2D SDfile   Computed 3D by Vconf -m prep SDfile
Find this compound or compounds like it in BindingDB:
Activity Spreadsheet -- Enzyme Inhibition Constant Data from BindingDB
Found 2 hits for monomerid = 352346
TargetAtaxin-1(Homo sapiens (Human))
Hoffmann-La Roche
US Patent
LigandPNGBDBM352346(US11098048, Example 2.04 | US9802944, Example 2.04)
Affinity DataIC50:  40nM. Assay description: Assay working solutions were made as follows:Assay buffer (50 mM Tris-HCl, 140 mM NaCl, 5 mM KCl, 1 mM CaCl2), 1 mM MgCl2, 0.01% Triton-X-100, pH 8.0...
Ligand InfoPC cidPC sid
In DepthDetails US Patent
TargetAtaxin-2(Homo sapiens (Human))
Hoffmann-La Roche
US Patent
LigandPNGBDBM352346(US11098048, Example 2.04 | US9802944, Example 2.04)
Affinity DataIC50:  40nM. Assay description: ATX inhibition was measured by a fluorescence quenching assay using a specifically labeled substrate analogue (MR121 substrate). To obtain this MR121...
Ligand InfoPC cidPC sid
In DepthDetails US Patent