BDBM352347 US9802939, II-62
SMILES CCOC(=O)[C@H]1CCCC[C@H](NC(=O)\C=C\c2cc(Cl)ccc2-n2cnnn2)c2cc(cc(=O)n2)-c2ccc(NC(=O)OC)cc2N1
InChI Key
Data  1 KI
  Tab Delimited (TSV)   2D SDfile   Computed 3D by Vconf -m prep SDfile
Find this compound or compounds like it in BindingDB:
Activity Spreadsheet -- Enzyme Inhibition Constant Data from BindingDB
Found 1 hit for monomerid = 352347
TargetCoagulation factor XI(Homo sapiens (Human))
Bristol-Myers Squibb
US Patent
LigandPNGBDBM352347(US9802939, II-62)
Affinity DataKi: <5nM. Assay description: Factor XIa determinations were made in 50 mM HEPES buffer at pH 7.4 containing 145 mM NaCl, 5 mM KCl, and 0.1% PEG 8000 (polyethylene glycol; JT Bake...
Ligand InfoPC cidPC sid
In DepthDetails US Patent