BDBM352389 1H-Triazol-4-ylmethyl (3aS,8aR)-6-[2-cyclopropyl-6-(oxan-4-ylmethoxy)pyridine-4-carbonyl]-1,3,3a,4,5,7,8,8a-octahydropyrrolo[3,4-d]azepine-2-carboxylate::US10654857, Example 7::US11098048, Example 7::US9802944, Example 7
SMILES O=C(OCc1c[nH]nn1)N1C[C@H]2CCN(CC[C@H]2C1)C(=O)c1cc(OCC2CCOCC2)nc(c1)C1CC1
InChI Key
Data  3 IC50
  Tab Delimited (TSV)   2D SDfile   Computed 3D by Vconf -m prep SDfile
Find this compound or compounds like it in BindingDB:
Activity Spreadsheet -- Enzyme Inhibition Constant Data from BindingDB
Found 3 hits for monomerid = 352389
TargetAtaxin-2(Homo sapiens (Human))
Hoffmann-La Roche
US Patent
LigandPNGBDBM352389(1H-Triazol-4-ylmethyl (3aS,8aR)-6-[2-cyclopropyl-6...)
Affinity DataIC50:  6nM. Assay description: ATX inhibition was measured by a fluorescence quenching assay using a specifically labeled substrate analogue (MR121 substrate). To obtain this MR121...
Ligand InfoPC cidPC sid
In DepthDetails US Patent
TargetAtaxin-1(Homo sapiens (Human))
Hoffmann-La Roche
US Patent
LigandPNGBDBM352389(1H-Triazol-4-ylmethyl (3aS,8aR)-6-[2-cyclopropyl-6...)
Affinity DataIC50:  6nM. Assay description: Assay working solutions were made as follows:Assay buffer (50 mM Tris-HCl, 140 mM NaCl, 5 mM KCl, 1 mM CaCl2), 1 mM MgCl2, 0.01% Triton-X-100, pH 8.0...
Ligand InfoPC cidPC sid
In DepthDetails US Patent
TargetAtaxin-2(Homo sapiens (Human))
Hoffmann-La Roche
US Patent
LigandPNGBDBM352389(1H-Triazol-4-ylmethyl (3aS,8aR)-6-[2-cyclopropyl-6...)
Affinity DataIC50:  6nM. Assay description: Assay working solutions were made as follows:Assay buffer (50 mM Tris-HCl, 140 mM NaCl, 5 mM KCl, 1 mM CaCl2, 1 mM MgCl2, 0.01% Triton-X-100, pH 8.0;...
Ligand InfoPC cidPC sid
In DepthDetails US Patent