BDBM352394 US9802945, 5
SMILES CCn1cnc2c(cnnc12)-c1ccc(F)c(c1)-c1ccc2CN(C)C(=O)c2c1
InChI Key InChIKey=CHIRBXJNJJPPBZ-UHFFFAOYSA-N
Data  1 KI
  Tab Delimited (TSV)   2D SDfile   Computed 3D by Vconf -m prep SDfile
Find this compound or compounds like it in BindingDB:
Activity Spreadsheet -- Enzyme Inhibition Constant Data from BindingDB
Found 1 hit for monomerid = 352394
TargetGamma-aminobutyric acid receptor subunit alpha-2(Homo sapiens (Human))
Pfizer
US Patent
LigandPNGBDBM352394(US9802945, 5)
Affinity DataKi:  21.7nM. Assay description: The affinity of the test compounds was determined by radioligand competition binding assay, using the known compound [3H]Ro-15-1788 (Flumazenil) (Per...
Ligand InfoPC cidPC sid
In DepthDetails US Patent