BDBM352423 N-((1S*,4S*,7R*)-2-(3-Aminoisoxazolo[5,4-c]pyridin-7-yl)-2-azabicyclo[2.2.1]heptan-7-yl)-2-chloro-4-(3-methyl-1H-1,2,4-triazol-1-yl)benzamide::US9808445, 2
SMILES Cc1ncn(n1)-c1ccc(C(=O)NC2C3CCC2N(C3)c2nccc3c(N)noc23)c(Cl)c1
InChI Key InChIKey=WBDHYAPOACOYPF-UHFFFAOYSA-N
Data  1 IC50
  Tab Delimited (TSV)   2D SDfile   Computed 3D by Vconf -m prep SDfile
Find this compound or compounds like it in BindingDB:
Activity Spreadsheet -- Enzyme Inhibition Constant Data from BindingDB
Found 1 hit for monomerid = 352423
TargetCoagulation factor IX(Homo sapiens (Human))
Merck Sharp & Dohme
US Patent
LigandPNGBDBM352423(N-((1S*,4S*,7R*)-2-(3-Aminoisoxazolo[5,4-c]pyridin...)
Affinity DataIC50: <100nM. Assay description: Inhibitory activity against factor IXa was tested using the substrate SPECTROFLUOR FIXa (american diagnostica inc.; 500 West Avenue, Stamford, Conn. ...
Ligand InfoPC cidPC sid
In DepthDetails US Patent