BDBM352437 N-((1S*,4S*,7R*)-2-(3-Amino-4-chloroisoxazolo[5,4-c]pyridin-7-yl)-2-azabicyclo[2.2.1]heptan-7-yl)-2-chloro-4-(pyridazin-4-yl)benzamide::US9808445, 12
SMILES Nc1noc2c(ncc(Cl)c12)N1CC2CCC1C2NC(=O)c1ccc(cc1Cl)-c1ccnnc1
InChI Key InChIKey=GGBARWRLKNNCKR-UHFFFAOYSA-N
Data  1 IC50
  Tab Delimited (TSV)   2D SDfile   Computed 3D by Vconf -m prep SDfile
Find this compound or compounds like it in BindingDB:
Activity Spreadsheet -- Enzyme Inhibition Constant Data from BindingDB
Found 1 hit for monomerid = 352437
TargetCoagulation factor IX(Homo sapiens (Human))
Merck Sharp & Dohme
US Patent
LigandPNGBDBM352437(N-((1S*,4S*,7R*)-2-(3-Amino-4-chloroisoxazolo[5,4-...)
Affinity DataIC50: <100nM. Assay description: Inhibitory activity against factor IXa was tested using the substrate SPECTROFLUOR FIXa (american diagnostica inc.; 500 West Avenue, Stamford, Conn. ...
Ligand InfoPC cidPC sid
In DepthDetails US Patent