BDBM352444 N-((1S*,4S*,7R*)-2-(3-Amino-4-chloroisoxazolo[5,4-c]pyridin-7-yl)-2-azabicyclo[2.2.1]heptan-7-yl)-2-chloro-4-(1-(difluoromethyl)-6-oxo-1,6-dihydropyridin-3-yl)benzamide::US9808445, 19
SMILES Nc1noc2c(ncc(Cl)c12)N1CC2CCC1C2NC(=O)c1ccc(cc1Cl)-c1ccc(=O)n(c1)C(F)F
InChI Key InChIKey=UFANDLMQPLGBSQ-UHFFFAOYSA-N
Data  1 IC50
  Tab Delimited (TSV)   2D SDfile   Computed 3D by Vconf -m prep SDfile
Find this compound or compounds like it in BindingDB:
Activity Spreadsheet -- Enzyme Inhibition Constant Data from BindingDB
Found 1 hit for monomerid = 352444
TargetCoagulation factor IX(Homo sapiens (Human))
Merck Sharp & Dohme
US Patent
LigandPNGBDBM352444(N-((1S*,4S*,7R*)-2-(3-Amino-4-chloroisoxazolo[5,4-...)
Affinity DataIC50: <100nM. Assay description: Inhibitory activity against factor IXa was tested using the substrate SPECTROFLUOR FIXa (american diagnostica inc.; 500 West Avenue, Stamford, Conn. ...
Ligand InfoPC cidPC sid
In DepthDetails US Patent