BDBM353253 4-(5-fluoro-2-methoxyphenyl)-2-(1,2,5,6-tetrahydropyridin-3-yl)-1H-pyrrolo[2,3-b]pyridine::US9796708, Example 485
SMILES COc1ccc(F)cc1-c1ccnc2[nH]c(cc12)C1=CCCNC1
InChI Key InChIKey=YFYSQSYEQXVGJJ-UHFFFAOYSA-N
Data  1 IC50
  Tab Delimited (TSV)   2D SDfile   Computed 3D by Vconf -m prep SDfile
Find this compound or compounds like it in BindingDB:
Activity Spreadsheet -- Enzyme Inhibition Constant Data from BindingDB
Found 1 hit for monomerid = 353253
TargetCyclin-T1/Cyclin-dependent kinase 9(Homo sapiens (Human))
Abbvie
US Patent
LigandPNGBDBM353253(4-(5-fluoro-2-methoxyphenyl)-2-(1,2,5,6-tetrahydro...)
Affinity DataIC50:  7nM. Assay description: CDK9 enzyme activities were measured using LANCE ULight TR-FRET kinase assay reagents (PerkinElmer, Waltham, Mass.). Compounds were directly added in...
Ligand InfoPC cidPC sid
In DepthDetails US Patent