BDBM353438 4-[4-(5-fluoro-2-methoxyphenyl)-1H-pyrrolo[2,3-b]pyridin-2-yl]-N-(pyrazin-2-ylmethyl)cyclohex-3-en-1-amine::US9796708, Example 670
SMILES COc1ccc(F)cc1-c1ccnc2[nH]c(cc12)C1=CCC(CC1)NCc1cnccn1
InChI Key
Data  1 IC50
  Tab Delimited (TSV)   2D SDfile   Computed 3D by Vconf -m prep SDfile
Find this compound or compounds like it in BindingDB:
Activity Spreadsheet -- Enzyme Inhibition Constant Data from BindingDB
Found 1 hit for monomerid = 353438
TargetCyclin-T1/Cyclin-dependent kinase 9(Homo sapiens (Human))
Abbvie
US Patent
LigandPNGBDBM353438(4-[4-(5-fluoro-2-methoxyphenyl)-1H-pyrrolo[2,3-b]p...)
Affinity DataIC50:  17nM. Assay description: CDK9 enzyme activities were measured using LANCE ULight TR-FRET kinase assay reagents (PerkinElmer, Waltham, Mass.). Compounds were directly added in...
Ligand InfoPC cidPC sid
In DepthDetails US Patent