BDBM354140 US9796725, Compound I-099::US9796725, Example 11
SMILES NS(=O)(=O)OC[C@H]1C[C@@H](Nc2ccnc3cc(nn23)-c2cccc3cc(ccc23)C(O)=O)C(O)[C@@H]1O
InChI Key InChIKey=GUAHEWCHNSONQK-RSDRRHTDSA-N
Data  1 IC50
  Tab Delimited (TSV)   2D SDfile   Computed 3D by Vconf -m prep SDfile
Find this compound or compounds like it in BindingDB:
Activity Spreadsheet -- Enzyme Inhibition Constant Data from BindingDB
Found 1 hit for monomerid = 354140
TargetSUMO-activating enzyme subunit 2(Homo sapiens (Human))
Millennium Pharmaceuticals
US Patent
LigandPNGBDBM354140(US9796725, Compound I-099 | US9796725, Example 11)
Affinity DataIC50: <10nM. Assay description: he UAE enzymatic reaction totals 50 μL and contains 50 mmol HEPES (pH 7.5), 0.05% BSA, 2.5 mM MgCl2, 0.1 uM ATP, 8 nM GST-Ubc-2, 35 nM flag-ubiq...
Ligand InfoPC cidPC sid
In DepthDetails US Patent