BDBM354146 US9796725, Compound I-105::US9796725, Example 9
SMILES NS(=O)(=O)OC[C@H]1C[C@@H](Nc2ccnc3cc(nn23)-c2cccc3c(F)cccc23)C(O)[C@@H]1O
InChI Key InChIKey=JLDRQTXJQWZHOB-LQOLKPNFSA-N
Data  1 IC50
  Tab Delimited (TSV)   2D SDfile   Computed 3D by Vconf -m prep SDfile
Find this compound or compounds like it in BindingDB:
Activity Spreadsheet -- Enzyme Inhibition Constant Data from BindingDB
Found 1 hit for monomerid = 354146
TargetSUMO-activating enzyme subunit 2(Homo sapiens (Human))
Millennium Pharmaceuticals
US Patent
LigandPNGBDBM354146(US9796725, Compound I-105 | US9796725, Example 9)
Affinity DataIC50: <10nM. Assay description: he UAE enzymatic reaction totals 50 μL and contains 50 mmol HEPES (pH 7.5), 0.05% BSA, 2.5 mM MgCl2, 0.1 uM ATP, 8 nM GST-Ubc-2, 35 nM flag-ubiq...
Ligand InfoPC cidPC sid
In DepthDetails US Patent