BDBM354150 US9796725, Compound I-109::US9796725, Example 9
SMILES CC(C)Oc1ccc2ccccc2c1-c1cc2nccc(N[C@@H]3C[C@H](COS(N)(=O)=O)[C@@H](O)C3O)n2n1
InChI Key InChIKey=VXKRKPOWQBOUDX-RSTACGASSA-N
Data  1 IC50
  Tab Delimited (TSV)   2D SDfile   Computed 3D by Vconf -m prep SDfile
Find this compound or compounds like it in BindingDB:
Activity Spreadsheet -- Enzyme Inhibition Constant Data from BindingDB
Found 1 hit for monomerid = 354150
TargetSUMO-activating enzyme subunit 2(Homo sapiens (Human))
Millennium Pharmaceuticals
US Patent
LigandPNGBDBM354150(US9796725, Compound I-109 | US9796725, Example 9)
Affinity DataIC50: <10nM. Assay description: he UAE enzymatic reaction totals 50 μL and contains 50 mmol HEPES (pH 7.5), 0.05% BSA, 2.5 mM MgCl2, 0.1 uM ATP, 8 nM GST-Ubc-2, 35 nM flag-ubiq...
Ligand InfoPC cidPC sid
In DepthDetails US Patent