BDBM354171 (2S,4R)-1-(2-(3-acetyl- 5-(pyridazin-4-yl)-1H- indol-1-yl)acetyl)-N- (2,2-dimethyl-2,3- dihydrobenzofuran-6- yl)-4-fluoropyrrolidine- 2-carboxamide::US10287301, Compound 75::US10822352, Comp No. 75::US9796741, cmp No. 75
SMILES CC(=O)c1cn(CC(=O)N2C[C@H](F)C[C@H]2C(=O)Nc2ccc3CC(C)(C)Oc3c2)c2ccc(cc12)-c1ccnnc1
InChI Key InChIKey=OHBNTBGQKUZLAO-AMGIVPHBSA-N
Data  3 IC50
  Tab Delimited (TSV)   2D SDfile   Computed 3D by Vconf -m prep SDfile
Find this compound or compounds like it in BindingDB:
Activity Spreadsheet -- Enzyme Inhibition Constant Data from BindingDB
Found 3 hits for monomerid = 354171
TargetComplement factor D(Homo sapiens (Human))
Achillion Pharmaceuticals
US Patent
LigandPNGBDBM354171((2S,4R)-1-(2-(3-acetyl- 5-(pyridazin-4-yl)-1H- ind...)
Affinity DataIC50: <1.00E+3nM. Assay description: Human factor D (purified from human serum, Complement Technology, Inc.) at 80 nM final concentration is incubated with test compound at various conce...
Ligand InfoPC cidPC sid
In DepthDetails US Patent
TargetComplement factor D(Homo sapiens (Human))
Achillion Pharmaceuticals
US Patent
LigandPNGBDBM354171((2S,4R)-1-(2-(3-acetyl- 5-(pyridazin-4-yl)-1H- ind...)
Affinity DataIC50: <1.00E+3nM. Assay description: Human Factor D (purified from human serum, Complement Technology, Inc.) at 80 nM final concentration was incubated with test compound at various conc...
Ligand InfoPC cidPC sid
In DepthDetails US Patent
TargetComplement factor D(Homo sapiens (Human))
Achillion Pharmaceuticals
US Patent
LigandPNGBDBM354171((2S,4R)-1-(2-(3-acetyl- 5-(pyridazin-4-yl)-1H- ind...)
Affinity DataIC50: <1.00E+3nM. Assay description: Human Factor D (purified from human serum, Complement Technology, Inc.) at 80 nM final concentration was incubated with test compound at various conc...
Ligand InfoPC cidPC sid
In DepthDetails US Patent