BDBM354234 (1R,3S,5R)-2-(2-(3- acetyl-5-(2- methylpyrimidin-5-yl)- 1H-indol-1-yl)acetyl)- N-(6-bromopyridin-2- yl)-2- azabicyclo[3.1.0] hexane-3-carboxamide::US10287301, Compound 132::US10822352, Comp No. 132::US9796741, cmp No. 132
SMILES CC(=O)c1cn(CC(=O)N2[C@@H]3C[C@@H]3C[C@H]2C(=O)Nc2cccc(Br)n2)c2ccc(cc12)-c1cnc(C)nc1
InChI Key InChIKey=VDORKYXTVASCJK-QFWMQHCXSA-N
Data  3 IC50
  Tab Delimited (TSV)   2D SDfile   Computed 3D by Vconf -m prep SDfile
Find this compound or compounds like it in BindingDB:
Activity Spreadsheet -- Enzyme Inhibition Constant Data from BindingDB
Found 3 hits for monomerid = 354234
TargetComplement factor D(Homo sapiens (Human))
Achillion Pharmaceuticals
US Patent
LigandPNGBDBM354234((1R,3S,5R)-2-(2-(3- acetyl-5-(2- methylpyrimidin-5...)
Affinity DataIC50: <1.00E+3nM. Assay description: Human factor D (purified from human serum, Complement Technology, Inc.) at 80 nM final concentration is incubated with test compound at various conce...
Ligand InfoPC cidPC sid
In DepthDetails US Patent
TargetComplement factor D(Homo sapiens (Human))
Achillion Pharmaceuticals
US Patent
LigandPNGBDBM354234((1R,3S,5R)-2-(2-(3- acetyl-5-(2- methylpyrimidin-5...)
Affinity DataIC50: <1.00E+3nM. Assay description: Human Factor D (purified from human serum, Complement Technology, Inc.) at 80 nM final concentration was incubated with test compound at various conc...
Ligand InfoPC cidPC sid
In DepthDetails US Patent
TargetComplement factor D(Homo sapiens (Human))
Achillion Pharmaceuticals
US Patent
LigandPNGBDBM354234((1R,3S,5R)-2-(2-(3- acetyl-5-(2- methylpyrimidin-5...)
Affinity DataIC50: <1.00E+3nM. Assay description: Human Factor D (purified from human serum, Complement Technology, Inc.) at 80 nM final concentration was incubated with test compound at various conc...
Ligand InfoPC cidPC sid
In DepthDetails US Patent