BDBM354256 (2S,4R)-1-(2-(3-acetyl- 5-(pyridazin-4-yl)-1H- indol-1-yl)acetyl)-4- fluoro-N-(2-methyl-3- oxo-3,4-dihydro-2H- benzo[b][1,4]oxazin-5- yl)pyrrolidine-2- carboxamide::US10287301, Compound 153::US10822352, Comp No. 153::US9796741, cmp No. 153
SMILES CC1Oc2cccc(NC(=O)[C@@H]3C[C@@H](F)CN3C(=O)Cn3cc(C(C)=O)c4cc(ccc34)-c3ccnnc3)c2NC1=O
InChI Key InChIKey=DNWBYAOOZUCOPM-SPGLARIMSA-N
Data  3 IC50
  Tab Delimited (TSV)   2D SDfile   Computed 3D by Vconf -m prep SDfile
Find this compound or compounds like it in BindingDB:
Activity Spreadsheet -- Enzyme Inhibition Constant Data from BindingDB
Found 3 hits for monomerid = 354256
TargetComplement factor D(Homo sapiens (Human))
Achillion Pharmaceuticals
US Patent
LigandPNGBDBM354256((2S,4R)-1-(2-(3-acetyl- 5-(pyridazin-4-yl)-1H- ind...)
Affinity DataIC50: >1.00E+4nM. Assay description: Human factor D (purified from human serum, Complement Technology, Inc.) at 80 nM final concentration is incubated with test compound at various conce...
Ligand InfoPC cidPC sid
In DepthDetails US Patent
TargetComplement factor D(Homo sapiens (Human))
Achillion Pharmaceuticals
US Patent
LigandPNGBDBM354256((2S,4R)-1-(2-(3-acetyl- 5-(pyridazin-4-yl)-1H- ind...)
Affinity DataIC50: >1.00E+4nM. Assay description: Human Factor D (purified from human serum, Complement Technology, Inc.) at 80 nM final concentration was incubated with test compound at various conc...
Ligand InfoPC cidPC sid
In DepthDetails US Patent
TargetComplement factor D(Homo sapiens (Human))
Achillion Pharmaceuticals
US Patent
LigandPNGBDBM354256((2S,4R)-1-(2-(3-acetyl- 5-(pyridazin-4-yl)-1H- ind...)
Affinity DataIC50: >1.00E+4nM. Assay description: Human Factor D (purified from human serum, Complement Technology, Inc.) at 80 nM final concentration was incubated with test compound at various conc...
Ligand InfoPC cidPC sid
In DepthDetails US Patent