BDBM354306 1-(3-(tert-Butyl)-1-(3-((dimethylphosphoryl)methyl)phenyl)-1H-pyrazol-5-yl)-3-(4-((2-((3-(2-morpholinoethoxy)phenyl)amino)pyrimidin-4-yl)oxy)naphthalen-1-yl)urea::US9796742, Example 34
SMILES CC(C)(C)c1cc(NC(=O)Nc2ccc(Oc3ccnc(Nc4cccc(OCCN5CCOCC5)c4)n3)c3ccccc23)n(n1)-c1cccc(CP(C)(C)=O)c1
InChI Key InChIKey=ODFHJBOEIZKPLN-UHFFFAOYSA-N
Data  1 IC50
  Tab Delimited (TSV)   2D SDfile   Computed 3D by Vconf -m prep SDfile
Find this compound or compounds like it in BindingDB:
Activity Spreadsheet -- Enzyme Inhibition Constant Data from BindingDB
Found 1 hit for monomerid = 354306
TargetGlycogen synthase kinase-3 alpha(Homo sapiens (Human))
Respivert
US Patent
LigandPNGBDBM354306(1-(3-(tert-Butyl)-1-(3-((dimethylphosphoryl)methyl...)
Affinity DataIC50:  324nM. Assay description: The inhibitory activities of compounds of the invention against the GSK 3?? enzyme isoform (Invitrogen), are evaluated by determining the level of ac...
Ligand InfoPC cidPC sid
In DepthDetails US Patent