BDBM354315 3-((4-((4-(3-(1-(3-((Dimethylphosphoryl)methyl)phenyl)-3-isopropyl-1H-pyrazol-5-yl)ureido)naphthalen-1-yl)oxy)pyrimidin-2-yl)amino)-5-ethynyl-N-(2-morpholinoethyl)benzamide::US9796742, Example 43
SMILES CC(C)c1cc(NC(=O)Nc2ccc(Oc3ccnc(Nc4cc(cc(c4)C(=O)NCCN4CCOCC4)C#C)n3)c3ccccc23)n(n1)-c1cccc(CP(C)(C)=O)c1
InChI Key InChIKey=WREPINARNKPEQA-UHFFFAOYSA-N
Data  1 IC50
  Tab Delimited (TSV)   2D SDfile   Computed 3D by Vconf -m prep SDfile
Find this compound or compounds like it in BindingDB:
Activity Spreadsheet -- Enzyme Inhibition Constant Data from BindingDB
Found 1 hit for monomerid = 354315
TargetGlycogen synthase kinase-3 alpha(Homo sapiens (Human))
Respivert
US Patent
LigandPNGBDBM354315(3-((4-((4-(3-(1-(3-((Dimethylphosphoryl)methyl)phe...)
Affinity DataIC50:  174nM. Assay description: The inhibitory activities of compounds of the invention against the GSK 3?? enzyme isoform (Invitrogen), are evaluated by determining the level of ac...
Ligand InfoPC cidPC sid
In DepthDetails US Patent