BDBM354725 Preparation of 5-(3,4-dimethoxyphenyl)-3-(1H-indol-5-yl)-1H-pyrrolo[2,3-b]pyridine ::US10485800, Example 2::US9814704, Example 2
SMILES COc1ccc(cc1OC)-c1cnc2[nH]cc(-c3ccc4[nH]ccc4c3)c2c1
InChI Key InChIKey=AIGXVESLNWYLRE-XDJHFCHBSA-N
Data  2 IC50
  Tab Delimited (TSV)   2D SDfile   Computed 3D by Vconf -m prep SDfile
Find this compound or compounds like it in BindingDB:
Activity Spreadsheet -- Enzyme Inhibition Constant Data from BindingDB
Found 2 hits for monomerid = 354725
TargetMitogen-activated protein kinase kinase kinase 11(Homo sapiens (Human))
The University Of Rochester
US Patent
LigandPNGBDBM354725(Preparation of 5-(3,4-dimethoxyphenyl)-3-(1H-indol...)
Affinity DataIC50:  550nM. Assay description: 200 ng (130 nM) MLK3 (Dundee, DU8313) was incubated with 1 μM inactive MKK7b (Dundee, DU703) in the presence of 2 μM cold ATP (Km) and 0.5 ...
Ligand InfoPC cidPC sid
In DepthDetails US Patent
TargetMitogen-activated protein kinase kinase kinase 11(Homo sapiens (Human))
The University Of Rochester
US Patent
LigandPNGBDBM354725(Preparation of 5-(3,4-dimethoxyphenyl)-3-(1H-indol...)
Affinity DataIC50:  550nM. Assay description: 200 ng (130 nM) MLK3 (Dundee, DU8313) was incubated with 1 μM inactive MKK7b (Dundee, DU703) in the presence of 2 μM cold ATP (Km) and 0.5 ...
Ligand InfoPC cidPC sid
In DepthDetails US Patent