BDBM354835 1-(1H-pyrrolo[2,3- b]pyridin-5-yl)-6-(3,4,5- trimethoxyphenyl)-1H- imidazo[4,5-b]pyrazin- 2(3H)-one::US10485800, Example 112::US9814704, Example 112
SMILES COc1cc(cc(OC)c1OC)-c1cnc2[nH]c(=O)n(-c3cnc4[nH]ccc4c3)c2n1
InChI Key InChIKey=RFDMUMKIWCFUBN-UHFFFAOYSA-N
Data  2 IC50
  Tab Delimited (TSV)   2D SDfile   Computed 3D by Vconf -m prep SDfile
Find this compound or compounds like it in BindingDB:
Activity Spreadsheet -- Enzyme Inhibition Constant Data from BindingDB
Found 2 hits for monomerid = 354835
TargetMitogen-activated protein kinase kinase kinase 11(Homo sapiens (Human))
The University Of Rochester
US Patent
LigandPNGBDBM354835(1-(1H-pyrrolo[2,3- b]pyridin-5-yl)-6-(3,4,5- trime...)
Affinity DataIC50: <100nM. Assay description: 200 ng (130 nM) MLK3 (Dundee, DU8313) was incubated with 1 μM inactive MKK7b (Dundee, DU703) in the presence of 2 μM cold ATP (Km) and 0.5 ...
Ligand InfoPC cidPC sid
In DepthDetails US Patent
TargetMitogen-activated protein kinase kinase kinase 11(Homo sapiens (Human))
The University Of Rochester
US Patent
LigandPNGBDBM354835(1-(1H-pyrrolo[2,3- b]pyridin-5-yl)-6-(3,4,5- trime...)
Affinity DataIC50: <100nM. Assay description: 200 ng (130 nM) MLK3 (Dundee, DU8313) was incubated with 1 μM inactive MKK7b (Dundee, DU703) in the presence of 2 μM cold ATP (Km) and 0.5 ...
Ligand InfoPC cidPC sid
In DepthDetails US Patent