BDBM354855 Preparation of 3-[2-oxo-5-(3,4,5-trimethoxy-phenyl)-1,2-dihydro-pyrrolo[2,3-b]pyridin-3-ylidenemethyl]-benzamide::US10485800, Example 132::US9814704, Example 132
SMILES COc1cc(cc(OC)c1OC)-c1cnc2NC(=O)C(=Cc3cccc(c3)C(N)=O)c2c1
InChI Key InChIKey=BODYCSYFOVDCON-UHFFFAOYSA-N
Data  2 IC50
  Tab Delimited (TSV)   2D SDfile   Computed 3D by Vconf -m prep SDfile
Find this compound or compounds like it in BindingDB:
Activity Spreadsheet -- Enzyme Inhibition Constant Data from BindingDB
Found 2 hits for monomerid = 354855
TargetMitogen-activated protein kinase kinase kinase 11(Homo sapiens (Human))
The University Of Rochester
US Patent
LigandPNGBDBM354855(Preparation of 3-[2-oxo-5-(3,4,5-trimethoxy-phenyl...)
Affinity DataIC50: >1.00E+3nM. Assay description: 200 ng (130 nM) MLK3 (Dundee, DU8313) was incubated with 1 μM inactive MKK7b (Dundee, DU703) in the presence of 2 μM cold ATP (Km) and 0.5 ...
Ligand InfoPC cidPC sid
In DepthDetails US Patent
TargetMitogen-activated protein kinase kinase kinase 11(Homo sapiens (Human))
The University Of Rochester
US Patent
LigandPNGBDBM354855(Preparation of 3-[2-oxo-5-(3,4,5-trimethoxy-phenyl...)
Affinity DataIC50: >1.00E+3nM. Assay description: 200 ng (130 nM) MLK3 (Dundee, DU8313) was incubated with 1 μM inactive MKK7b (Dundee, DU703) in the presence of 2 μM cold ATP (Km) and 0.5 ...
Ligand InfoPC cidPC sid
In DepthDetails US Patent